Target
Mitogen-activated protein kinase 1
Ligand
BDBM50115402
Substrate
Meas. Tech.
ChEMBL_1513909 (CHEMBL3611591)
IC50
0.010000±n/a nM
Citation
 Bagdanoff, JTJain, RHan, WZhu, SMadiera, AMLee, PSMa, XPoon, D Tetrahydropyrrolo-diazepenones as inhibitors of ERK2 kinase. Bioorg Med Chem Lett 25:3788-92 (2015)  
Target
Name:
Mitogen-activated protein kinase 1
Synonyms:
ERK2 Extracellular signal-regulated kinase 2 Extracellular signal-regulated kinase 2 (ERK2) MAPK 2 MK01_HUMAN Mitogen-activated protein kinase 1 (ERK-2) Mitogen-activated protein kinase 2 PRKM2 | p42-MAPK
Type:
Ser/Thr Protein Kinase
Mol. Mass.:
41392.76
Organism:
Homo sapiens (Human)
Description:
P28482
Residue:
360
  
Inhibitor
Name:
BDBM50115402
Synonyms:
CHEMBL3608588
Type:
Small organic molecule
Emp. Form.:
C25H28ClN5O3
Mol. Mass.:
481.975
SMILES:
OC[C@@H](N1CCCn2cc(cc2C1=O)-c1ccnc(NC2CCOCC2)n1)c1cccc(Cl)c1
: