Target
Adenosine receptor A3
Ligand
BDBM50116854
Substrate
Meas. Tech.
ChEMBL_1515683 (CHEMBL3616297)
Ki
21±n/a nM
Citation
 Tosh, DKCrane, SChen, ZPaoletta, SGao, ZGGizewski, EAuchampach, JASalvemini, DJacobson, KA Rigidified A3 Adenosine Receptor Agonists: 1-Deazaadenine Modification Maintains High in Vivo Efficacy. ACS Med Chem Lett 6:804-8 (2015)  
Target
Name:
Adenosine receptor A3
Synonyms:
A3 adenosine receptor (hA3) ADORA3 | Adenosine A3 receptor (A3AR)
Type:
G Protein-Coupled Receptor (GPCR)
Mol. Mass.:
36197.32
Organism:
Homo sapiens (Human)
Description:
P0DMS8
Residue:
318
  
Inhibitor
Name:
BDBM50116854
Synonyms:
CHEMBL3612946
Type:
Small organic molecule
Emp. Form.:
C24H26ClN9O3S
Mol. Mass.:
556.04
SMILES:
[H][C@]12C[C@]1([C@@H](O)[C@@H](O)[C@@H]2n1cnc2c(NCC3CCC3)nc(nc12)-n1cc(nn1)-c1ccc(Cl)s1)C(=O)NC
: