Target
Prostaglandin G/H synthase 2
Ligand
BDBM50116888
Substrate
Meas. Tech.
ChEMBL_1515771 (CHEMBL3614430)
IC50
50000±n/a nM
Citation
 Seebacher, WFaist, JPresser, AWeis, RSaf, RKaserer, TTemml, VSchuster, DOrtmann, SOtto, NBauer, R Synthesis of new 4-phenylpyrimidine-2(1H)-thiones and their potency to inhibit COX-1 and COX-2. Eur J Med Chem 101:552-9 (2015)  
Target
Name:
Prostaglandin G/H synthase 2
Synonyms:
COX2 Cyclooxygenase-2 (COX-2) PTGS2 Prostaglandin G/H synthase (cyclooxygenase)
Type:
Protein
Mol. Mass.:
68976.98
Organism:
Ovis aries (Sheep)
Description:
Residue:
603
  
Inhibitor
Name:
BDBM50116888
Synonyms:
CHEMBL3612976
Type:
Small organic molecule
Emp. Form.:
C11H11N3O2S
Mol. Mass.:
249.289
SMILES:
CC1=CC(NC(=S)N1)c1ccccc1[N+]([O-])=O
: