Target
Cannabinoid receptor 1
Ligand
BDBM50116910
Substrate
Meas. Tech.
ChEMBL_1516108 (CHEMBL3615751)
Ki
>5000±n/a nM
Citation
 Ragusa, GGómez-Cañas, MMorales, PHurst, DPDeligia, FPazos, RPinna, GAFernández-Ruiz, JGoya, PReggio, PHJagerovic, NGarcía-Arencibia, MMurineddu, G Synthesis, pharmacological evaluation and docking studies of pyrrole structure-based CB2 receptor antagonists. Eur J Med Chem 101:651-67 (2015)  
Target
Name:
Cannabinoid receptor 1
Synonyms:
CANN6 CB-R CNR CNR1_HUMAN Cannabinoid receptor Cannabinoid receptor 1 (brain)
Type:
G Protein-Coupled Receptor (GPCR)
Mol. Mass.:
52868.96
Organism:
Homo sapiens (Human)
Description:
P21554
Residue:
472
  
Inhibitor
Name:
BDBM50116910
Synonyms:
CHEMBL3613102
Type:
Small organic molecule
Emp. Form.:
C30H33ClN2O
Mol. Mass.:
473.049
SMILES:
Cc1ccc(Cn2cc(cc2-c2ccc(Cl)c(C)c2)C(=O)NC23CC4CC(CC(C4)C2)C3)cc1
: