Target
LIM domain kinase 2
Ligand
BDBM50117303
Substrate
Meas. Tech.
ChEMBL_1514398 (CHEMBL3615477)
IC50
7.4±n/a nM
Citation
 Boland, SBourin, AAlen, JGeraets, JSchroeders, PCastermans, KKindt, NBoumans, NPanitti, LVanormelingen, JFransen, SVan de Velde, SDefert, O Design, synthesis and biological characterization of selective LIMK inhibitors. Bioorg Med Chem Lett 25:4005-10 (2015)  
Target
Name:
LIM domain kinase 2
Synonyms:
LIMK2 | LIMK2_HUMAN
Type:
PROTEIN
Mol. Mass.:
72238.81
Organism:
Homo sapiens (Human)
Description:
ChEMBL_1514398
Residue:
638
  
Inhibitor
Name:
BDBM50117303
Synonyms:
CHEMBL3613601
Type:
Small organic molecule
Emp. Form.:
C21H24N6O3
Mol. Mass.:
408.4537
SMILES:
COC(=O)c1cccc(NC(=O)C2(N)CCN(CC2)c2ncnc3[nH]cc(C)c23)c1
: