Target
Carbonic anhydrase 9
Ligand
BDBM50117677
Substrate
Meas. Tech.
ChEMBL_1515208 (CHEMBL3614555)
Ki
27±n/a nM
Citation
 Buemi, MRDe Luca, LFerro, SBruno, ECeruso, MSupuran, CTPospí?ilová, KBrynda, JRezácová, PGitto, R Carbonic anhydrase inhibitors: Design, synthesis and structural characterization of new heteroaryl-N-carbonylbenzenesulfonamides targeting druggable human carbonic anhydrase isoforms. Eur J Med Chem 102:223-32 (2015)  
Target
Name:
Carbonic anhydrase 9
Synonyms:
CA-IX CAH9_HUMAN Carbonic anhydrase 9 (CA IX) Carbonic anhydrase 9 precursor Carbonic anhydrase IX (CAIX) Carbonic anhydrases; II & IX MN RCC-associated antigen G250
Type:
Enzyme
Mol. Mass.:
49669.03
Organism:
Homo sapiens (Human)
Description:
Catalytic domain of human cloned isozyme was used in the assay
Residue:
459
  
Inhibitor
Name:
BDBM50117677
Synonyms:
CHEMBL3613778
Type:
Small organic molecule
Emp. Form.:
C17H18N2O4S
Mol. Mass.:
346.401
SMILES:
COc1ccc2CN(CCc2c1)C(=O)c1ccc(cc1)S(N)(=O)=O
: