Target
Carbonic anhydrase 1
Ligand
BDBM50117676
Substrate
Meas. Tech.
ChEMBL_1515205 (CHEMBL3614552)
Ki
186±n/a nM
Citation
 Buemi, MRDe Luca, LFerro, SBruno, ECeruso, MSupuran, CTPospí?ilová, KBrynda, JRezácová, PGitto, R Carbonic anhydrase inhibitors: Design, synthesis and structural characterization of new heteroaryl-N-carbonylbenzenesulfonamides targeting druggable human carbonic anhydrase isoforms. Eur J Med Chem 102:223-32 (2015)  
Target
Name:
Carbonic anhydrase 1
Synonyms:
CA-I CAB Carbonate dehydratase I Carbonic anhydrase 1 (CA I) Carbonic anhydrase 1 (Recombinant CA I) Carbonic anhydrase B Carbonic anhydrase I (CA I) Carbonic anhydrase I (CAI) Carbonic anhydrase isoenzyme I (hCA I) | hCA
Type:
Enzyme
Mol. Mass.:
28873.37
Organism:
Homo sapiens (Human)
Description:
P00915
Residue:
261
  
Inhibitor
Name:
BDBM50117676
Synonyms:
CHEMBL3613779
Type:
Small organic molecule
Emp. Form.:
C16H16N2O4S
Mol. Mass.:
332.374
SMILES:
NS(=O)(=O)c1ccc(cc1)C(=O)N1CCc2cc(O)ccc2C1
: