Target
Carbonic anhydrase 7
Ligand
BDBM50117673
Substrate
Meas. Tech.
ChEMBL_1515207 (CHEMBL3614554)
Ki
4.0±n/a nM
Citation
 Buemi, MRDe Luca, LFerro, SBruno, ECeruso, MSupuran, CTPospí?ilová, KBrynda, JRezácová, PGitto, R Carbonic anhydrase inhibitors: Design, synthesis and structural characterization of new heteroaryl-N-carbonylbenzenesulfonamides targeting druggable human carbonic anhydrase isoforms. Eur J Med Chem 102:223-32 (2015)  
Target
Name:
Carbonic anhydrase 7
Synonyms:
CA-VII CAH7_HUMAN Carbonic anhydrase Carbonic anhydrase VII (CA VII)
Type:
Enzyme
Mol. Mass.:
29664.11
Organism:
Homo sapiens (Human)
Description:
Human cloned isozyme.
Residue:
264
  
Inhibitor
Name:
BDBM50117673
Synonyms:
CHEMBL3613782
Type:
Small organic molecule
Emp. Form.:
C16H16N2O4S
Mol. Mass.:
332.374
SMILES:
NS(=O)(=O)c1ccc(cc1)C(=O)N1CCCc2cc(O)ccc12
: