Target
Carbonic anhydrase 2
Ligand
BDBM50117669
Substrate
Meas. Tech.
ChEMBL_1515206 (CHEMBL3614553)
Ki
4.7±n/a nM
Citation
 Buemi, MRDe Luca, LFerro, SBruno, ECeruso, MSupuran, CTPospí?ilová, KBrynda, JRezácová, PGitto, R Carbonic anhydrase inhibitors: Design, synthesis and structural characterization of new heteroaryl-N-carbonylbenzenesulfonamides targeting druggable human carbonic anhydrase isoforms. Eur J Med Chem 102:223-32 (2015)  
Target
Name:
Carbonic anhydrase 2
Synonyms:
CA-II CAC Carbonate dehydratase II Carbonic anhydrase 2 (CA-II) Carbonic anhydrase C Carbonic anhydrase II (CA-II) Carbonic anhydrase II (hCA II) | Carbonic anhydrase isoenzyme II (hCA II)
Type:
Enzyme
Mol. Mass.:
29250.71
Organism:
Homo sapiens (Human)
Description:
P00918
Residue:
260
  
Inhibitor
Name:
BDBM50117669
Synonyms:
CHEMBL3613777
Type:
Small organic molecule
Emp. Form.:
C16H16N2O5S
Mol. Mass.:
348.374
SMILES:
NS(=O)(=O)c1ccc(cc1)C(=O)N1CCc2cc(O)c(O)cc2C1
: