Target
Kappa-type opioid receptor
Ligand
BDBM50118190
Substrate
Meas. Tech.
ChEMBL_1514758 (CHEMBL3614959)
Ki
0.543000±n/a nM
Citation
 Nakajima, RYamamoto, NHirayama, SIwai, TSaitoh, ANagumo, YFujii, HNagase, H Synthesis of new opioid derivatives with a propellane skeleton and their pharmacologies: Part 5, novel pentacyclic propellane derivatives with a 6-amide side chain. Bioorg Med Chem 23:6271-9 (2015)  
Target
Name:
Kappa-type opioid receptor
Synonyms:
KOR-1 OPIATE Kappa Oprk1
Type:
Enzyme
Mol. Mass.:
42656.78
Organism:
Mus musculus (Mouse)
Description:
P33534
Residue:
380
  
Inhibitor
Name:
BDBM50118190
Synonyms:
CHEMBL3613174
Type:
Small organic molecule
Emp. Form.:
C30H37ClN2O2
Mol. Mass.:
493.08
SMILES:
Cl.[H][C@]12CC[C@]3([H])N(CC4CC4)CC[C@@]4(C[C@H]1N(C)C(=O)c1ccccc1)c1cc(O)ccc1C[C@@]34C2
: