Target
Mu-type opioid receptor
Ligand
BDBM50008984
Substrate
Meas. Tech.
ChEMBL_1515758 (CHEMBL3614311)
Ki
5.9±n/a nM
Citation
 Deekonda, SWugalter, LKulkarni, VRankin, DLargent-Milnes, TMDavis, PBassirirad, NMLai, JVanderah, TWPorreca, FHruby, VJ Discovery of 5-substituted tetrahydronaphthalen-2yl-methyl with N-phenyl-N-(piperidin-4-yl)propionamide derivatives as potent opioid receptor ligands. Bioorg Med Chem 23:6185-94 (2015)  
Target
Name:
Mu-type opioid receptor
Synonyms:
M-OR-1 Mor OPRM_MOUSE Oprm | Oprm1
Type:
Enzyme Catalytic Domain
Mol. Mass.:
44431.62
Organism:
MOUSE
Description:
OPIATE Mu OPRM1 MOUSE::P42866
Residue:
398
  
Inhibitor
Name:
BDBM50008984
Synonyms:
4-(4-Chloro-benzyl)-2-(1-methyl-azepan-4-yl)-2H-phthalazin-1-one Duragesic-100 Duragesic-25 Duragesic-75 FENTANYL CITRATE Fentanyl-100 Fentanyl-25 Fentanyl-75 Innovar N-(1-Phenethyl-piperidin-4-yl)-N-phenyl-propionamide N-(1-phenethylpiperidin-4-yl)-N-phenylpropionamide | US20230399418, Compound Fentanyl
Type:
Small organic molecule
Emp. Form.:
C22H28N2O
Mol. Mass.:
336.4705
SMILES:
CCC(=O)N(C1CCN(CCc2ccccc2)CC1)c1ccccc1
: