Target
Mitogen-activated protein kinase 3
Ligand
BDBM120095
Substrate
Meas. Tech.
ChEMBL_1517780 (CHEMBL3620376)
IC50
1.2±n/a nM
Citation
 Uehling, DEHarris, PA Recent progress on MAP kinase pathway inhibitors. Bioorg Med Chem Lett 25:4047-56 (2015)  
Target
Name:
Mitogen-activated protein kinase 3
Synonyms:
ERK1 Extracellular signal-regulated kinase 1 MAP kinase ERK1 MAPK3/MAPK7 Mitogen-activated protein kinase PRKM3
Type:
Protein
Mol. Mass.:
43136.58
Organism:
Homo sapiens (Human)
Description:
curated by PDB 4QTB
Residue:
379
  
Inhibitor
Name:
BDBM120095
Synonyms:
US10525036, Example GDC-0994 US8697715, 39 | US9259470, 39
Type:
Small organic molecule
Emp. Form.:
C21H18ClFN6O2
Mol. Mass.:
440.858
SMILES:
Cn1nccc1Nc1nccc(n1)-c1ccn([C@H](CO)c2ccc(Cl)c(F)c2)c(=O)c1
: