Target
Muscarinic acetylcholine receptor M3
Ligand
BDBM50061705
Substrate
Meas. Tech.
ChEMBL_1517986 (CHEMBL3618843)
EC50
117±n/a nM
Citation
 Liu, BCroy, CHHitchcock, SAAllen, JRRao, ZEvans, DBures, MGMcKinzie, DLWatt, MLStuart Gregory, GHansen, MMHoogestraat, PJJamison, JAOkha-Mokube, FMStratford, RETurner, WBymaster, FFelder, CC Design and synthesis of N-[6-(Substituted Aminoethylideneamino)-2-Hydroxyindan-1-yl]arylamides as selective and potent muscarinic M1 agonists. Bioorg Med Chem Lett 25:4158-63 (2015)  
Target
Name:
Muscarinic acetylcholine receptor M3
Synonyms:
ACM3_HUMAN Cholinergic, muscarinic M3 Muscarinic receptor M3 | RecName: Full=Muscarinic acetylcholine receptor M3
Type:
Enzyme
Mol. Mass.:
66151.03
Organism:
Homo sapiens (Human)
Description:
P20309
Residue:
590
  
Inhibitor
Name:
BDBM50061705
Synonyms:
(R)-1-Aza-bicyclo[2.2.2]oct-3-yl-[(Z)-methoxyimino]-acetonitrile SB-202026
Type:
Small organic molecule
Emp. Form.:
C10H15N3O
Mol. Mass.:
193.2456
SMILES:
CO\N=C(/C#N)[C@H]1CN2CCC1CC2
: