Target
Poly [ADP-ribose] polymerase 1
Ligand
BDBM50446130
Substrate
Meas. Tech.
ChEMBL_1517675 (CHEMBL3619957)
IC50
0.804400±n/a nM
Citation
 Xie, ZZhou, YZhao, WJiao, HChen, YYang, YLi, Z Identification of novel PARP-1 inhibitors: Drug design, synthesis and biological evaluation. Bioorg Med Chem Lett 25:4557-61 (2015)  
Target
Name:
Poly [ADP-ribose] polymerase 1
Synonyms:
(ARTD1 or PARP1) 2.4.2.30 ADPRT ARTD1 Human diphtheria toxin-like ADP-ribosyltransferase (ARTD1 or PARP1) NT-PARP-1 PARP1 PPOL Poly [ADP-ribose] polymerase 1 (PARP) Poly [ADP-ribose] polymerase 1 (PARP1) Poly [ADP-ribose] polymerase 1, 28-kDa form Poly [ADP-ribose] polymerase 1, processed C-terminus Poly [ADP-ribose] polymerase-1 Poly(ADP-ribose) polymerase-1 (ARTD1/PARP1) Protein poly-ADP-ribosyltransferase PARP1 | Synonyms=ADPRT
Type:
Mol. Mass.:
113114.22
Organism:
Homo sapiens (Human)
Description:
P09874
Residue:
1014
  
Inhibitor
Name:
BDBM50446130
Synonyms:
AG-014699 RUCAPARIB CAMSYLATE | Rucaparib
Type:
Small organic molecule
Emp. Form.:
C19H18FN3O
Mol. Mass.:
323.3641
SMILES:
CNCc1ccc(cc1)-c1[nH]c2cc(F)cc3C(=O)NCCc1c23
: