Target
Alpha-amylase 1A
Ligand
BDBM50120832
Substrate
Meas. Tech.
ChEMBL_1516310 (CHEMBL3618750)
IC50
100000±n/a nM
Citation
 Al-Asri, JFazekas, ELehoczki, GPerdih, AGörick, CMelzig, MFGyémánt, GWolber, GMortier, J From carbohydrates to drug-like fragments: Rational development of novela-amylase inhibitors. Bioorg Med Chem 23:6725-32 (2015)  
Target
Name:
Alpha-amylase 1A
Synonyms:
1,4-alpha-D-glucan glucanohydrolase 1 AMY1A Alpha-amylase | Salivary alpha-amylase
Type:
Glycosidase
Mol. Mass.:
57770.18
Organism:
Homo sapiens (Human)
Description:
Purchased from Sigma Chemical Co.
Residue:
511
  
Inhibitor
Name:
BDBM50120832
Synonyms:
CHEMBL3618483
Type:
Small organic molecule
Emp. Form.:
C17H14N2O3S
Mol. Mass.:
326.37
SMILES:
CC(=O)c1cccc(Nc2nc(cs2)-c2ccc(O)cc2O)c1
: