Target
Carbonic anhydrase 2
Ligand
BDBM26980
Substrate
Meas. Tech.
ChEMBL_1521735 (CHEMBL3626558)
Ki
63000000±n/a nM
Citation
 Mahon, BPDíaz-Torres, NAPinard, MATu, CSilverman, DNScott, KMMcKenna, R Activity and anion inhibition studies of thea-carbonic anhydrase from Thiomicrospira crunogena XCL-2 Gammaproteobacterium. Bioorg Med Chem Lett 25:4937-40 (2015)  
Target
Name:
Carbonic anhydrase 2
Synonyms:
CA-II CAC Carbonate dehydratase II Carbonic anhydrase 2 (CA-II) Carbonic anhydrase C Carbonic anhydrase II (CA-II) Carbonic anhydrase II (hCA II) | Carbonic anhydrase isoenzyme II (hCA II)
Type:
Enzyme
Mol. Mass.:
29250.71
Organism:
Homo sapiens (Human)
Description:
P00918
Residue:
260
  
Inhibitor
Name:
BDBM26980
Synonyms:
Br- CHEMBL1644694 bromide ion
Type:
Ion
Emp. Form.:
Br
Mol. Mass.:
79.905
SMILES:
[Br-]
: