Target
A disintegrin and metalloproteinase with thrombospondin motifs 4
Ligand
BDBM50122500
Substrate
Meas. Tech.
ChEMBL_1519714 (CHEMBL3624059)
IC50
>10000±n/a nM
Citation
 Ding, YO'Keefe, HDeLorey, JLIsrael, DIMesser, JAChiu, CHSkinner, SRMatico, REMurray-Thompson, MFLi, FClark, MACuozzo, JWArico-Muendel, CMorgan, BA Discovery of Potent and Selective Inhibitors for ADAMTS-4 through DNA-Encoded Library Technology (ELT). ACS Med Chem Lett 6:888-93 (2015)  
Target
Name:
A disintegrin and metalloproteinase with thrombospondin motifs 4
Synonyms:
A disintegrin and metalloproteinase with thrombospondin motifs 4 (ADAMTS-4) ATS4_HUMAN KIAA0688 | Metalloproteinase with thrombospondin motifs 4 (ADAMTS-4)
Type:
Enzyme
Mol. Mass.:
90214.54
Organism:
Homo sapiens (Human)
Description:
O75173
Residue:
837
  
Inhibitor
Name:
BDBM50122500
Synonyms:
CHEMBL3622501
Type:
Small organic molecule
Emp. Form.:
C29H38N8O4
Mol. Mass.:
562.6632
SMILES:
COc1cc2CCN(Cc2cc1OC)c1nc(NCCN2CCN(C)CC2)nc(NCc2ccc(cc2)C(O)=O)n1
: