Target
Delta-type opioid receptor
Ligand
BDBM50123595
Substrate
Meas. Tech.
ChEMBL_1521809 (CHEMBL3626669)
Ki
>1000±n/a nM
Citation
 Lee, DYDeng, GMa, ZXu, WYang, LLiu, JDai, RLiu-Chen, LY Synthesis and biological evaluation of 2-alkyl-2-methoxymethyl-salvinorin ethers as selectiveż-opioid receptor agonists. Bioorg Med Chem Lett 25:4689-92 (2015)  
Target
Name:
Delta-type opioid receptor
Synonyms:
DOR-1 MSL-2 OPRD_MOUSE Oprd1
Type:
Enzyme Catalytic Domain
Mol. Mass.:
40577.25
Organism:
MOUSE
Description:
P32300
Residue:
372
  
Inhibitor
Name:
BDBM50123595
Synonyms:
CHEMBL3622710
Type:
Small organic molecule
Emp. Form.:
C25H34O7
Mol. Mass.:
446.5333
SMILES:
[H][C@]12CC[C@@]3(C)[C@@H](C[C@](CC)(COC)C(=O)[C@]3([H])[C@@]1(C)C[C@H](OC2=O)c1ccoc1)C(=O)OC
: