Target
Mu-type opioid receptor
Ligand
BDBM50123590
Substrate
Meas. Tech.
ChEMBL_1521811 (CHEMBL3626671)
Ki
>1000±n/a nM
Citation
 Lee, DYDeng, GMa, ZXu, WYang, LLiu, JDai, RLiu-Chen, LY Synthesis and biological evaluation of 2-alkyl-2-methoxymethyl-salvinorin ethers as selectiveż-opioid receptor agonists. Bioorg Med Chem Lett 25:4689-92 (2015)  
Target
Name:
Mu-type opioid receptor
Synonyms:
MOR-1 Mu-type opioid receptor (MOR) OPRM_RAT Opioid receptor B Ror-b
Type:
G Protein-Coupled Receptor (GPCR)
Mol. Mass.:
44503.11
Organism:
Rattus norvegicus (rat)
Description:
Competition binding assays were carried out using membrane preparations from transfected HN9.10 cells that constitutively expressed the mu opioid receptor.
Residue:
398
  
Inhibitor
Name:
BDBM50123590
Synonyms:
CHEMBL3622714
Type:
Small organic molecule
Emp. Form.:
C26H34O7
Mol. Mass.:
458.544
SMILES:
[H][C@@]12CC[C@@]3(C)[C@@H](C[C@@](COC)(CC=C)C(=O)[C@]3([H])[C@@]1(C)C[C@H](OC2=O)c1ccoc1)C(=O)OC
: