Target
Histone deacetylase 3
Ligand
BDBM50354086
Substrate
Meas. Tech.
ChEMBL_1522023 (CHEMBL3627130)
IC50
62±n/a nM
Citation
 Yao, YTu, ZLiao, CWang, ZLi, SYao, HLi, ZJiang, S Discovery of Novel Class I Histone Deacetylase Inhibitors with Promising in Vitro and in Vivo Antitumor Activities. J Med Chem 58:7672-80 (2015)  
Target
Name:
Histone deacetylase 3
Synonyms:
HD3 HDAC3_HUMAN Human HDAC3 SMAP45
Type:
Enzyme
Mol. Mass.:
48829.55
Organism:
Homo sapiens (Human)
Description:
O15379
Residue:
428
  
Inhibitor
Name:
BDBM50354086
Synonyms:
FK-228 ROMIDEPSIN
Type:
Small organic molecule
Emp. Form.:
C25H39N3O6S2
Mol. Mass.:
541.724
SMILES:
C\C=C1/NC(=O)[C@@H](CS)NC(=O)[C@H](CC(=O)C[C@H](OC(=O)[C@@H](NC1=O)C(C)C)\C=C\CCS)C(C)C
: