Target
LIM domain kinase 2
Ligand
BDBM50124355
Substrate
Meas. Tech.
ChEMBL_1520364 (CHEMBL3624102)
IC50
3.0±n/a nM
Citation
 Charles, MDBrookfield, JLEkwuru, TCStockley, MDunn, JRiddick, MHammonds, TTrivier, EGreenland, GWong, ACCheasty, ABoyd, SCrighton, DOlson, MF Discovery, Development, and SAR of Aminothiazoles as LIMK Inhibitors with Cellular Anti-Invasive Properties. J Med Chem 58:8309-13 (2015)  
Target
Name:
LIM domain kinase 2
Synonyms:
LIMK2 | LIMK2_HUMAN
Type:
PROTEIN
Mol. Mass.:
72238.81
Organism:
Homo sapiens (Human)
Description:
ChEMBL_1514398
Residue:
638
  
Inhibitor
Name:
BDBM50124355
Synonyms:
CHEMBL3623442
Type:
Small organic molecule
Emp. Form.:
C19H18ClN3OS
Mol. Mass.:
371.884
SMILES:
CC(C)C(=O)Nc1ncc(s1)-c1ccncc1-c1ccc(C)cc1Cl
: