Target
LIM domain kinase 1
Ligand
BDBM50124354
Substrate
Meas. Tech.
ChEMBL_1520363 (CHEMBL3624101)
IC50
6600±n/a nM
Citation
 Charles, MDBrookfield, JLEkwuru, TCStockley, MDunn, JRiddick, MHammonds, TTrivier, EGreenland, GWong, ACCheasty, ABoyd, SCrighton, DOlson, MF Discovery, Development, and SAR of Aminothiazoles as LIMK Inhibitors with Cellular Anti-Invasive Properties. J Med Chem 58:8309-13 (2015)  
Target
Name:
LIM domain kinase 1
Synonyms:
LIMK LIMK1 | LIMK1_HUMAN
Type:
Enzyme Catalytic Domain
Mol. Mass.:
72591.81
Organism:
Homo sapiens (Human)
Description:
gi_4505001
Residue:
647
  
Inhibitor
Name:
BDBM50124354
Synonyms:
CHEMBL3623439
Type:
Small organic molecule
Emp. Form.:
C20H14ClN3OS
Mol. Mass.:
379.863
SMILES:
Oc1ccc(Nc2ncc(s2)-c2ccncc2-c2ccccc2Cl)cc1
: