Target
Kallikrein-5 [D153N]
Ligand
BDBM50124906
Substrate
Meas. Tech.
ChEMBL_1522074 (CHEMBL3627279)
Ki
2.1±n/a nM
Citation
 de Veer, SJWang, CKHarris, JMCraik, DJSwedberg, JE Improving the Selectivity of Engineered Protease Inhibitors: Optimizing the P2 Prime Residue Using a Versatile Cyclic Peptide Library. J Med Chem 58:8257-68 (2015)  
Target
Name:
Kallikrein-5 [D153N]
Synonyms:
KLK-L2 KLK5_HUMAN Kallikrein-5 SCTE | Stratum corneum tryptic enzyme
Type:
PROTEIN
Mol. Mass.:
32031.75
Organism:
Homo sapiens (Human)
Description:
ChEMBL_1282456
Residue:
293
  
Inhibitor
Name:
BDBM50124906
Synonyms:
CHEMBL3623776
Type:
Small organic molecule
Emp. Form.:
C60H97N19O19S2
Mol. Mass.:
1452.658
SMILES:
[H][C@@]12CCCN1C(=O)[C@H](CC(N)=O)NC(=O)[C@]1([H])CSSC[C@]([H])(NC(=O)[C@@]([H])(NC(=O)CNC(=O)[C@H](CC(N)=O)NC2=O)[C@@H](C)O)C(=O)N[C@@]([H])([C@@H](C)O)C(=O)N[C@@H](CCCNC(N)=N)C(=O)N[C@@H](CO)C(=O)N[C@@]([H])([C@@H](C)CC)C(=O)N2CCC[C@@]2([H])C(=O)N2CCC[C@@]2([H])C(=O)N[C@@]([H])([C@@H](C)CC)C(=O)N1
: