Target
Prothrombin
Ligand
BDBM50125048
Substrate
Meas. Tech.
ChEMBL_1522072 (CHEMBL3627232)
Ki
>50000±n/a nM
Citation
 de Veer, SJWang, CKHarris, JMCraik, DJSwedberg, JE Improving the Selectivity of Engineered Protease Inhibitors: Optimizing the P2 Prime Residue Using a Versatile Cyclic Peptide Library. J Med Chem 58:8257-68 (2015)  
Target
Name:
Prothrombin
Synonyms:
Activation peptide fragment 1 Coagulation factor II Prothrombin precursor Thrombin heavy chain | Thrombin light chain
Type:
Protein
Mol. Mass.:
70029.57
Organism:
Homo sapiens (Human)
Description:
P00734
Residue:
622
  
Inhibitor
Name:
BDBM50125048
Synonyms:
CHEMBL3623788
Type:
Small organic molecule
Emp. Form.:
C55H93N21O15S2
Mol. Mass.:
1352.589
SMILES:
[H][C@@]12CCCN1C(=O)[C@]1([H])CCCN1C(=O)[C@@]([H])(NC(=O)[C@H](CO)NC(=O)[C@H](CCCCN)NC(=O)[C@@]([H])(NC(=O)[C@H](CSSC[C@H](NC(=O)[C@H](CCCNC(N)=N)NC2=O)C(=O)N[C@@H](Cc1cnc[nH]1)C(O)=O)NC(=O)[C@H](CCCNC(N)=N)NC(=O)CN)[C@@H](C)O)[C@@H](C)CC
: