Target
Metabotropic glutamate receptor 1
Ligand
BDBM50128021
Substrate
Meas. Tech.
ChEMBL_1522998 (CHEMBL3631330)
EC50
356±n/a nM
Citation
 Garcia-Barrantes, PMCho, HPNiswender, CMByers, FWLocuson, CWBlobaum, ALXiang, ZRook, JMConn, PJLindsley, CW Development of Novel, CNS Penetrant Positive Allosteric Modulators for the Metabotropic Glutamate Receptor Subtype 1 (mGlu1), Based on an N-(3-Chloro-4-(1,3-dioxoisoindolin-2-yl)phenyl)-3-methylfuran-2-carboxamide Scaffold, That Potentiate Wild Type and Mutant mGlu1 Receptors Found in Schizophrenics J Med Chem 58:7959-71 (2015)  
Target
Name:
Metabotropic glutamate receptor 1
Synonyms:
GRM1_RAT Grm1 Metabotropic glutamate receptor Mglur1 metabotropic glutamate 1/5-D metabotropic glutamate receptor 1 isoform alpha precursor
Type:
Enzyme Catalytic Domain
Mol. Mass.:
133240.47
Organism:
RAT
Description:
metabotropic glutamate 1/2 0 RAT::P23385
Residue:
1199
  
Inhibitor
Name:
BDBM50128021
Synonyms:
CHEMBL3628116
Type:
Small organic molecule
Emp. Form.:
C20H10Cl3N3O3
Mol. Mass.:
446.671
SMILES:
Clc1cccc2C(=O)N(C(=O)c12)c1ccc(NC(=O)c2ncccc2Cl)cc1Cl
: