Target
Mitogen-activated protein kinase 9
Ligand
BDBM50128294
Substrate
Meas. Tech.
ChEMBL_1523710 (CHEMBL3631849)
IC50
5000±n/a nM
Citation
 Patel, SHarris, SFGibbons, PDeshmukh, GGustafson, AKellar, TLin, HLiu, XLiu, YLiu, YMa, CScearce-Levie, KGhosh, ASShin, YGSolanoy, HWang, JWang, BYin, JSiu, MLewcock, JW Scaffold-Hopping and Structure-Based Discovery of Potent, Selective, And Brain Penetrant N-(1H-Pyrazol-3-yl)pyridin-2-amine Inhibitors of Dual Leucine Zipper Kinase (DLK, MAP3K12). J Med Chem 58:8182-99 (2015)  
Target
Name:
Mitogen-activated protein kinase 9
Synonyms:
JNK-55 JNK2/JNK3 MK09_HUMAN Mitogen-activated protein kinase 8/9 SAPK1A c-Jun N-terminal kinase 2 | c-Jun N-terminal kinase 2 (JNK2)
Type:
Enzyme
Mol. Mass.:
48131.49
Organism:
Homo sapiens (Human)
Description:
JNK-2 was purchased from Upstate Cell Signaling Solutions (formerly Upstate Biotechnology).
Residue:
424
  
Inhibitor
Name:
BDBM50128294
Synonyms:
CHEMBL3629013
Type:
Small organic molecule
Emp. Form.:
C22H28N6O
Mol. Mass.:
392.4973
SMILES:
N#Cc1ccnc(Nc2cc(C3CCN(CC3)C3COC3)n(n2)C2CCCC2)c1
: