Target
Beta-2 adrenergic receptor
Ligand
BDBM25771
Substrate
Meas. Tech.
ChEMBL_1522875 (CHEMBL3630593)
EC50
2.7±n/a nM
Citation
 Jones, LHBurrows, JFeeder, NGlossop, PJames, KJones, RMKenyon, ASPatel, SRoberts, DFSelby, MDStrang, RSStuart, EFTrevethick, MAWatson, JWright, KNClarke, N Molecular hybridization yields triazole bronchodilators for the treatment of COPD. Bioorg Med Chem Lett 25:5121-6 (2015)  
Target
Name:
Beta-2 adrenergic receptor
Synonyms:
ADRB2_CAVPO adrenergic Beta2
Type:
Enzyme Catalytic Domain
Mol. Mass.:
46993.24
Organism:
GUINEA PIG
Description:
adrenergic Beta2 ADRB2 GUINEA PIG::Q8K4Z4
Residue:
418
  
Inhibitor
Name:
BDBM25771
Synonyms:
1-hydroxy-2-naphthoic acid;4-[1-hydroxy-2-[6-(4-phenylbutoxy)hexylamino]ethyl]-2-methylol-phenol Aeromax Serevent | salmeterol xinafoate
Type:
Small organic molecule
Emp. Form.:
C25H37NO4
Mol. Mass.:
415.5656
SMILES:
OCc1cc(ccc1O)C(O)CNCCCCCCOCCCCc1ccccc1
: