Target
Potassium voltage-gated channel subfamily H member 2
Ligand
BDBM50129560
Substrate
Meas. Tech.
ChEMBL_1523572 (CHEMBL3631371)
IC50
4800±n/a nM
Citation
 Le Manach, CPaquet, TBrunschwig, CNjoroge, MHan, ZGonzàlez Cabrera, DBashyam, SDhinakaran, RTaylor, DReader, JBotha, MChurchyard, ALauterbach, SCoetzer, TLBirkholtz, LMMeister, SWinzeler, EAWaterson, DWitty, MJWittlin, SJiménez-Díaz, MBSantos Martínez, MFerrer, SAngulo-Barturen, IStreet, LJChibale, K A Novel Pyrazolopyridine with in Vivo Activity in Plasmodium berghei- and Plasmodium falciparum-Infected Mouse Models from Structure-Activity Relationship Studies around the Core of Recently Identified Antimalarial Imidazopyridazines. J Med Chem 58:8713-22 (2015)  
Target
Name:
Potassium voltage-gated channel subfamily H member 2
Synonyms:
1,3-beta-glucan synthase component GLS2 ERG Eag-related protein 1 Ether-a-go-go-related gene (HERG) Ether-a-go-go-related gene potassium channel 1 Ether-a-go-go-related gene potassium channel 1 (hERG1) Ether-a-go-go-related protein 1 H-ERG KCNH2 Potassium voltage-gated channel subfamily H member 2 (hERG) Voltage-gated potassium channel subunit Kv11.1 hERG Potassium Channel 1 | putative potassium channel subunit
Type:
Multi-pass membrane protein
Mol. Mass.:
126672.65
Organism:
Homo sapiens (Human)
Description:
Q12809
Residue:
1159
  
Inhibitor
Name:
BDBM50129560
Synonyms:
CHEMBL3628216
Type:
Small organic molecule
Emp. Form.:
C21H18N2O4S2
Mol. Mass.:
426.509
SMILES:
CS(=O)(=O)c1ccc(cc1)-c1cnc2ccc(cn12)-c1cccc(c1)S(C)(=O)=O
: