Target
Rho-associated protein kinase 2
Ligand
BDBM50130038
Substrate
Meas. Tech.
ChEMBL_1524294 (CHEMBL3631887)
IC50
2114±n/a nM
Citation
 Cui, JDing, MDeng, WYin, YWang, ZZhou, HSun, GJiang, YFeng, Y Discovery of bis-aryl urea derivatives as potent and selective Limk inhibitors: Exploring Limk1 activity and Limk1/ROCK2 selectivity through a combined computational study. Bioorg Med Chem 23:7464-77 (2015)  
Target
Name:
Rho-associated protein kinase 2
Synonyms:
KIAA0619 ROCK2 Rho kinase 2 (ROCKII) Rho-associated protein kinase 2 (ROCK2) Rho-associated protein kinase 2/Transforming protein RhoA Rho-associated, coiled-coil-containing protein kinase II p164 ROCK-2
Type:
Protein
Mol. Mass.:
160885.43
Organism:
Homo sapiens (Human)
Description:
O75116
Residue:
1388
  
Inhibitor
Name:
BDBM50130038
Synonyms:
CHEMBL3629277
Type:
Small organic molecule
Emp. Form.:
C20H17FN6O
Mol. Mass.:
376.387
SMILES:
Cc1c[nH]c2ncnc(-c3ccc(NC(=O)Nc4ccc(C)nc4)c(F)c3)c12
: