Target
LIM domain kinase 1
Ligand
BDBM50130037
Substrate
Meas. Tech.
ChEMBL_1524293 (CHEMBL3631886)
IC50
19±n/a nM
Citation
 Cui, JDing, MDeng, WYin, YWang, ZZhou, HSun, GJiang, YFeng, Y Discovery of bis-aryl urea derivatives as potent and selective Limk inhibitors: Exploring Limk1 activity and Limk1/ROCK2 selectivity through a combined computational study. Bioorg Med Chem 23:7464-77 (2015)  
Target
Name:
LIM domain kinase 1
Synonyms:
LIMK LIMK1 | LIMK1_HUMAN
Type:
Enzyme Catalytic Domain
Mol. Mass.:
72591.81
Organism:
Homo sapiens (Human)
Description:
gi_4505001
Residue:
647
  
Inhibitor
Name:
BDBM50130037
Synonyms:
CHEMBL3629278
Type:
Small organic molecule
Emp. Form.:
C20H17FN6O
Mol. Mass.:
376.387
SMILES:
Cc1c[nH]c2ncnc(-c3ccc(NC(=O)Nc4ccnc(C)c4)c(F)c3)c12
: