Target
MAP kinase-interacting serine/threonine-protein kinase 2
Ligand
BDBM50130697
Substrate
Meas. Tech.
ChEMBL_1527068 (CHEMBL3637759)
Ki
164±n/a nM
Citation
 Teo, TYang, YYu, MBasnet, SKGillam, THou, JSchmid, RMKumarasiri, MDiab, SAlbrecht, HSykes, MJWang, S An integrated approach for discovery of highly potent and selective Mnk inhibitors: Screening, synthesis and SAR analysis. Eur J Med Chem 103:539-50 (2015)  
Target
Name:
MAP kinase-interacting serine/threonine-protein kinase 2
Synonyms:
GPRK7 MAP kinase-interacting serine/threonine-protein kinase 2 (MKNK2) MAP-kinase interacting kinase 2 (MNK2) MKNK2_HUMAN | MNK2
Type:
Protein
Mol. Mass.:
51870.79
Organism:
Homo sapiens (Human)
Description:
Q9HBH9
Residue:
465
  
Inhibitor
Name:
BDBM50130697
Synonyms:
CHEMBL3632740
Type:
Small organic molecule
Emp. Form.:
C14H10FN3O2S
Mol. Mass.:
303.312
SMILES:
Cc1c(sc2ncnc(Nc3ccc(F)cc3)c12)C(O)=O
: