Target
MAP kinase-interacting serine/threonine-protein kinase 1
Ligand
BDBM50130704
Substrate
Meas. Tech.
ChEMBL_1527074 (CHEMBL3637765)
Ki
106±n/a nM
Citation
 Teo, TYang, YYu, MBasnet, SKGillam, THou, JSchmid, RMKumarasiri, MDiab, SAlbrecht, HSykes, MJWang, S An integrated approach for discovery of highly potent and selective Mnk inhibitors: Screening, synthesis and SAR analysis. Eur J Med Chem 103:539-50 (2015)  
Target
Name:
MAP kinase-interacting serine/threonine-protein kinase 1
Synonyms:
MAP Kinase-Interacting Protein Kinase (MNK1) MAP kinase-interacting serine/threonine-protein kinase 1 (MnK1) MAP-kinase interacting kinase 1 (MNK1) MKNK1 MNK1
Type:
Serine/threonine-protein kinase
Mol. Mass.:
51342.85
Organism:
Homo sapiens (Human)
Description:
Q9BUB5
Residue:
465
  
Inhibitor
Name:
BDBM50130704
Synonyms:
CHEMBL3632744
Type:
Small organic molecule
Emp. Form.:
C18H19FN4O2S
Mol. Mass.:
374.432
SMILES:
CNC(=O)c1sc2ncnc(Nc3ccc(F)cc3OC(C)C)c2c1C
: