Target
Protein arginine N-methyltransferase 1 [11-371]
Ligand
BDBM50130929
Substrate
Meas. Tech.
ChEMBL_1526069 (CHEMBL3636218)
Ki
1700±n/a nM
Citation
 Yu, XRTang, YWang, WJJi, SMa, SZhong, LZhang, CHYang, JWu, XAFu, ZYLi, LLYang, SY Discovery and structure-activity analysis of 4-((5-nitropyrimidin-4-yl)amino)benzimidamide derivatives as novel protein arginine methyltransferase 1 (PRMT1) inhibitors. Bioorg Med Chem Lett 25:5449-53 (2015)  
Target
Name:
Protein arginine N-methyltransferase 1 [11-371]
Synonyms:
ANM1_HUMAN HRMT1L2 PRMT1 Protein arginine methyltransferase 1 (PRMT1) | Protein-arginine N-methyltransferase 1
Type:
Protein
Mol. Mass.:
41506.52
Organism:
Homo sapiens (Human)
Description:
Q99873[11-371]
Residue:
361
  
Inhibitor
Name:
BDBM50130929
Synonyms:
CHEMBL3633189
Type:
Small organic molecule
Emp. Form.:
C18H14N8O2
Mol. Mass.:
374.3562
SMILES:
NC(=N)c1ccc(Nc2ncnc(Nc3ccc(cc3)C#N)c2[N+]([O-])=O)cc1
: