Target
Serine/threonine-protein kinase pim-1
Ligand
BDBM50131226
Substrate
Meas. Tech.
ChEBML_1526828
Ki
0.036000±n/a nM
Citation
 Hu, HWang, XChan, GKChang, JHDo, SDrummond, JEbens, ALee, WLy, JLyssikatos, JPMurray, JMoffat, JGChao, QTsui, VWallweber, HKolesnikov, A Discovery of 3,5-substituted 6-azaindazoles as potent pan-Pim inhibitors. Bioorg Med Chem Lett 25:5258-64 (2015)  
Target
Name:
Serine/threonine-protein kinase pim-1
Synonyms:
PIM-1 Kinase PIM1_HUMAN Serine/threonine-protein kinase (PIM1) Serine/threonine-protein kinase PIM1 | Serine/threonine-protein kinase pim-1 (PIM1)
Type:
Protein
Mol. Mass.:
35681.82
Organism:
Homo sapiens (Human)
Description:
P11309
Residue:
313
  
Inhibitor
Name:
BDBM50131226
Synonyms:
CHEMBL3634770 | US9260425, 234
Type:
Small organic molecule
Emp. Form.:
C19H20N8
Mol. Mass.:
360.4157
SMILES:
Cn1cc(cn1)-c1cc2c(n[nH]c2cn1)-c1cccc(n1)N1CCNCC1
: