Target
Serine/threonine-protein kinase pim-1
Ligand
BDBM50131278
Substrate
Meas. Tech.
ChEBML_1526828
Ki
0.013000±n/a nM
Citation
 Hu, HWang, XChan, GKChang, JHDo, SDrummond, JEbens, ALee, WLy, JLyssikatos, JPMurray, JMoffat, JGChao, QTsui, VWallweber, HKolesnikov, A Discovery of 3,5-substituted 6-azaindazoles as potent pan-Pim inhibitors. Bioorg Med Chem Lett 25:5258-64 (2015)  
Target
Name:
Serine/threonine-protein kinase pim-1
Synonyms:
PIM-1 Kinase PIM1_HUMAN Serine/threonine-protein kinase (PIM1) Serine/threonine-protein kinase PIM1 | Serine/threonine-protein kinase pim-1 (PIM1)
Type:
Protein
Mol. Mass.:
35681.82
Organism:
Homo sapiens (Human)
Description:
P11309
Residue:
313
  
Inhibitor
Name:
BDBM50131278
Synonyms:
CHEMBL3634760 | US9260425, 433
Type:
Small organic molecule
Emp. Form.:
C21H24N8
Mol. Mass.:
388.4689
SMILES:
Cc1ccc(nc1N1CCC[C@H](N)C1)-c1n[nH]c2cnc(cc12)-c1cnn(C)c1
: