Target
Serine/threonine-protein kinase pim-3
Ligand
BDBM50131262
Substrate
Meas. Tech.
ChEBML_1526830
Ki
0.120000±n/a nM
Citation
 Hu, HWang, XChan, GKChang, JHDo, SDrummond, JEbens, ALee, WLy, JLyssikatos, JPMurray, JMoffat, JGChao, QTsui, VWallweber, HKolesnikov, A Discovery of 3,5-substituted 6-azaindazoles as potent pan-Pim inhibitors. Bioorg Med Chem Lett 25:5258-64 (2015)  
Target
Name:
Serine/threonine-protein kinase pim-3
Synonyms:
PIM3 Serine/threonine-protein kinase pim-3 (PIM3)
Type:
Protein
Mol. Mass.:
35888.19
Organism:
Homo sapiens (Human)
Description:
Q86V86
Residue:
326
  
Inhibitor
Name:
BDBM50131262
Synonyms:
CHEMBL3634768 | US9260425, 247
Type:
Small organic molecule
Emp. Form.:
C20H21N7
Mol. Mass.:
359.4276
SMILES:
Cn1cc(cn1)-c1cc2c(n[nH]c2cn1)-c1cccc(n1)C1CCNCC1
: