Target
Carbonic anhydrase 7
Ligand
BDBM50259746
Substrate
Meas. Tech.
ChEMBL_1523556 (CHEMBL3631204)
Ki
620±n/a nM
Citation
 Maresca, AAkyuz, GOsman, SMAlOthman, ZSupuran, CT Inhibition of mammalian carbonic anhydrase isoforms I-XIV with a series of phenolic acid esters. Bioorg Med Chem 23:7181-8 (2015)  
Target
Name:
Carbonic anhydrase 7
Synonyms:
CA-VII CAH7_HUMAN Carbonic anhydrase Carbonic anhydrase VII (CA VII)
Type:
Enzyme
Mol. Mass.:
29664.11
Organism:
Homo sapiens (Human)
Description:
Human cloned isozyme.
Residue:
264
  
Inhibitor
Name:
BDBM50259746
Synonyms:
(4-Hydroxyphenyl)ethyl trans-ferulate p-Hydroxyphenethyl trans-ferulate (18) | p-hydroxyphenethyl trans-ferulate
Type:
Small organic molecule
Emp. Form.:
C18H18O5
Mol. Mass.:
314.3325
SMILES:
COc1cc(\C=C\C(=O)OCCc2ccc(O)cc2)ccc1O
: