Target
Carbonic anhydrase 9
Ligand
BDBM50131682
Substrate
Meas. Tech.
ChEMBL_1523557 (CHEMBL3631205)
Ki
970±n/a nM
Citation
 Maresca, AAkyuz, GOsman, SMAlOthman, ZSupuran, CT Inhibition of mammalian carbonic anhydrase isoforms I-XIV with a series of phenolic acid esters. Bioorg Med Chem 23:7181-8 (2015)  
Target
Name:
Carbonic anhydrase 9
Synonyms:
CA-IX CAH9_HUMAN Carbonic anhydrase 9 (CA IX) Carbonic anhydrase 9 precursor Carbonic anhydrase IX (CAIX) Carbonic anhydrases; II & IX MN RCC-associated antigen G250
Type:
Enzyme
Mol. Mass.:
49669.03
Organism:
Homo sapiens (Human)
Description:
Catalytic domain of human cloned isozyme was used in the assay
Residue:
459
  
Inhibitor
Name:
BDBM50131682
Synonyms:
CHEMBL3628132
Type:
Small organic molecule
Emp. Form.:
C25H24O6
Mol. Mass.:
420.4545
SMILES:
Oc1cccc(CCOc2cccc(CCOC(=O)\C=C\c3ccc(O)c(O)c3)c2)c1
: