Target
Carbonic anhydrase 13
Ligand
BDBM50131681
Substrate
Meas. Tech.
ChEMBL_1523559 (CHEMBL3631207)
Ki
840±n/a nM
Citation
 Maresca, AAkyuz, GOsman, SMAlOthman, ZSupuran, CT Inhibition of mammalian carbonic anhydrase isoforms I-XIV with a series of phenolic acid esters. Bioorg Med Chem 23:7181-8 (2015)  
Target
Name:
Carbonic anhydrase 13
Synonyms:
CA-XIII Ca13 Carbonate dehydratase XIII Carbonic anhydrase XIII
Type:
Enzyme
Mol. Mass.:
29522.80
Organism:
Mus musculus (mouse)
Description:
Murine cloned isozyme
Residue:
262
  
Inhibitor
Name:
BDBM50131681
Synonyms:
CHEMBL3628131
Type:
Small organic molecule
Emp. Form.:
C25H24O6
Mol. Mass.:
420.4545
SMILES:
Oc1ccc(CCOc2ccc(CCOC(=O)\C=C\c3ccc(O)c(O)c3)cc2)cc1
: