Target
Metabotropic glutamate receptor 5
Ligand
BDBM50132507
Substrate
Meas. Tech.
ChEMBL_1527446 (CHEMBL3636977)
EC50
60±n/a nM
Citation
 Malosh, CTurlington, MBridges, TMRook, JMNoetzel, MJVinson, PNSteckler, TLavreysen, HMackie, CBartolomé-Nebreda, JMConde-Ceide, SMartínez-Viturro, CMPiedrafita, MSánchez-Casado, MRMacdonald, GJDaniels, JSJones, CKNiswender, CMConn, PJLindsley, CWStauffer, SR Acyl dihydropyrazolo[1,5-a]pyrimidinones as metabotropic glutamate receptor 5 positive allosteric modulators. Bioorg Med Chem Lett 25:5115-20 (2015)  
Target
Name:
Metabotropic glutamate receptor 5
Synonyms:
GRM5_RAT Grm5 Mglur5 metabotropic glutamate 5/1-C metabotropic glutamate 5a
Type:
Enzyme
Mol. Mass.:
131900.14
Organism:
Rattus norvegicus (Rat)
Description:
P31424
Residue:
1203
  
Inhibitor
Name:
BDBM50132507
Synonyms:
CHEMBL3633943
Type:
Small organic molecule
Emp. Form.:
C15H17N3O2
Mol. Mass.:
271.3144
SMILES:
CC(=O)N1CCCn2nc(COc3ccccc3)cc12
: