Target
Carbonic anhydrase 2
Ligand
BDBM50133405
Substrate
Meas. Tech.
ChEMBL_1525819 (CHEMBL3635733)
Ki
63±n/a nM
Citation
 La Regina, GColuccia, AFamiglini, VPelliccia, SMonti, LVullo, DNuti, EAlterio, VDe Simone, GMonti, SMPan, PParkkila, SSupuran, CTRossello, ASilvestri, R Discovery of 1,1'-Biphenyl-4-sulfonamides as a New Class of Potent and Selective Carbonic Anhydrase XIV Inhibitors. J Med Chem 58:8564-72 (2015)  
Target
Name:
Carbonic anhydrase 2
Synonyms:
CA-II CAC Carbonate dehydratase II Carbonic anhydrase 2 (CA-II) Carbonic anhydrase C Carbonic anhydrase II (CA-II) Carbonic anhydrase II (hCA II) | Carbonic anhydrase isoenzyme II (hCA II)
Type:
Enzyme
Mol. Mass.:
29250.71
Organism:
Homo sapiens (Human)
Description:
P00918
Residue:
260
  
Inhibitor
Name:
BDBM50133405
Synonyms:
CHEMBL3632841
Type:
Small organic molecule
Emp. Form.:
C19H14N2O5S
Mol. Mass.:
382.39
SMILES:
NS(=O)(=O)c1ccc(cc1)-c1ccc(cc1)C(=O)c1ccc(cc1)[N+]([O-])=O
: