Target
Carbonic anhydrase 9
Ligand
BDBM50133401
Substrate
Meas. Tech.
ChEMBL_1525820 (CHEMBL3635734)
Ki
77±n/a nM
Citation
 La Regina, GColuccia, AFamiglini, VPelliccia, SMonti, LVullo, DNuti, EAlterio, VDe Simone, GMonti, SMPan, PParkkila, SSupuran, CTRossello, ASilvestri, R Discovery of 1,1'-Biphenyl-4-sulfonamides as a New Class of Potent and Selective Carbonic Anhydrase XIV Inhibitors. J Med Chem 58:8564-72 (2015)  
Target
Name:
Carbonic anhydrase 9
Synonyms:
CA-IX CAH9_HUMAN Carbonic anhydrase 9 (CA IX) Carbonic anhydrase 9 precursor Carbonic anhydrase IX (CAIX) Carbonic anhydrases; II & IX MN RCC-associated antigen G250
Type:
Enzyme
Mol. Mass.:
49669.03
Organism:
Homo sapiens (Human)
Description:
Catalytic domain of human cloned isozyme was used in the assay
Residue:
459
  
Inhibitor
Name:
BDBM50133401
Synonyms:
CHEMBL3632837
Type:
Small organic molecule
Emp. Form.:
C21H19NO4S
Mol. Mass.:
381.445
SMILES:
COC(=O)c1ccc(Cc2ccc(cc2)-c2ccc(cc2)S(N)(=O)=O)cc1
: