Target
Myeloperoxidase
Ligand
BDBM50133601
Substrate
Meas. Tech.
ChEMBL_1526127 (CHEMBL3636511)
IC50
2000±n/a nM
Citation
 Ruggeri, RBBuckbinder, LBagley, SWCarpino, PAConn, ELDowling, MSFernando, DPJiao, WKung, DWOrr, STQi, YRocke, BNSmith, AWarmus, JSZhang, YBowles, DWidlicka, DWEng, HRyder, TSharma, RWolford, AOkerberg, CWalters, KMaurer, TSZhang, YBonin, PDSpath, SNXing, GHepworth, DAhn, KKalgutkar, AS Discovery of 2-(6-(5-Chloro-2-methoxyphenyl)-4-oxo-2-thioxo-3,4-dihydropyrimidin-1(2H)-yl)acetamide (PF-06282999): A Highly Selective Mechanism-Based Myeloperoxidase Inhibitor for the Treatment of Cardiovascular Diseases. J Med Chem 58:8513-28 (2015)  
Target
Name:
Myeloperoxidase
Synonyms:
84 kDa myeloperoxidase MPO Myeloperoxidase Myeloperoxidase heavy chain PERM_HUMAN
Type:
Enzyme
Mol. Mass.:
83888.32
Organism:
Homo sapiens (Human)
Description:
P05164
Residue:
745
  
Inhibitor
Name:
BDBM50133601
Synonyms:
CHEMBL3633251
Type:
Small organic molecule
Emp. Form.:
C14H16N2O4S
Mol. Mass.:
308.353
SMILES:
COc1ccc(c(OC)c1)-c1cc(=O)[nH]c(=S)n1CCO
: