Target
Cytochrome P450 2D6
Ligand
BDBM50133595
Substrate
Meas. Tech.
ChEMBL_1526311 (CHEMBL3637258)
IC50
>100000±n/a nM
Citation
 Ruggeri, RBBuckbinder, LBagley, SWCarpino, PAConn, ELDowling, MSFernando, DPJiao, WKung, DWOrr, STQi, YRocke, BNSmith, AWarmus, JSZhang, YBowles, DWidlicka, DWEng, HRyder, TSharma, RWolford, AOkerberg, CWalters, KMaurer, TSZhang, YBonin, PDSpath, SNXing, GHepworth, DAhn, KKalgutkar, AS Discovery of 2-(6-(5-Chloro-2-methoxyphenyl)-4-oxo-2-thioxo-3,4-dihydropyrimidin-1(2H)-yl)acetamide (PF-06282999): A Highly Selective Mechanism-Based Myeloperoxidase Inhibitor for the Treatment of Cardiovascular Diseases. J Med Chem 58:8513-28 (2015)  
Target
Name:
Cytochrome P450 2D6
Synonyms:
CP2D6_HUMAN CYP2DL1 Cytochrome P450 2D6 (CYP2D6) P450-DB1
Type:
Protein
Mol. Mass.:
55774.82
Organism:
Homo sapiens (Human)
Description:
P10635
Residue:
497
  
Inhibitor
Name:
BDBM50133595
Synonyms:
CHEMBL3633460
Type:
Small organic molecule
Emp. Form.:
C13H12ClN3O3S
Mol. Mass.:
325.771
SMILES:
COc1ccc(Cl)cc1-c1cc(=O)[nH]c(=S)n1CC(N)=O
: