Target
Kappa-type opioid receptor
Ligand
BDBM50133891
Substrate
Meas. Tech.
ChEMBL_1526690 (CHEMBL3636125)
Ki
19±n/a nM
Citation
 Harland, AAYeomans, LGriggs, NWAnand, JPPogozheva, IDJutkiewicz, EMTraynor, JRMosberg, HI Further Optimization and Evaluation of Bioavailable, Mixed-Efficacyµ-Opioid Receptor (MOR) Agonists/d-Opioid Receptor (DOR) Antagonists: Balancing MOR and DOR Affinities. J Med Chem 58:8952-69 (2015)  
Target
Name:
Kappa-type opioid receptor
Synonyms:
K-OR-1 Kappa-opioid receptor (KOR) Kappa-type opioid receptor (KOR) OPIATE Kappa OPRK1 kappa opioid receptor (KOR)
Type:
G Protein-Coupled Receptor (GPCR)
Mol. Mass.:
42648.76
Organism:
Homo sapiens (Human)
Description:
P41145
Residue:
380
  
Inhibitor
Name:
BDBM50133891
Synonyms:
CHEMBL3634257
Type:
Small organic molecule
Emp. Form.:
C30H35N3O2
Mol. Mass.:
469.6178
SMILES:
Cc1cc(O)cc(C)c1C[C@H](N)C(=O)N[C@@H]1CCNc2ccc(CC3CCc4ccccc34)cc12
: