Target
Polyphenol oxidase 2
Ligand
BDBM50133897
Substrate
Meas. Tech.
ChEMBL_1526710 (CHEMBL3636248)
Ki
8700±n/a nM
Citation
 Radhakrishnan, SShimmon, RConn, CBaker, A Inhibitory kinetics of novel 2,3-dihydro-1H-inden-1-one chalcone-like derivatives on mushroom tyrosinase. Bioorg Med Chem Lett 25:5495-9 (2015)  
Target
Name:
Polyphenol oxidase 2
Synonyms:
Monophenol monooxygenase PPO2 Tyrosinase
Type:
Protein
Mol. Mass.:
63923.66
Organism:
Agaricus bisporus (Common mushroom)
Description:
O42713
Residue:
556
  
Inhibitor
Name:
BDBM50133897
Synonyms:
CHEMBL3634267
Type:
Small organic molecule
Emp. Form.:
C16H12O3
Mol. Mass.:
252.2647
SMILES:
Oc1ccc(\C=C2\Cc3ccccc3C2=O)cc1O
: