Target
Carbonic anhydrase, alpha family
Ligand
BDBM10861
Substrate
Meas. Tech.
ChEMBL_1543854 (CHEMBL3749744)
Ki
488±n/a nM
Citation
 Vullo, DBhatt, AMahon, BPMcKenna, RSupuran, CT Sulfonamide inhibition studies of thea-carbonic anhydrase from the gammaproteobacterium Thiomicrospira crunogena XCL-2, TcruCA. Bioorg Med Chem Lett 26:401-5 (2016)  
Target
Name:
Carbonic anhydrase, alpha family
Synonyms:
Carbonic anhydrase, alpha family
Type:
PROTEIN
Mol. Mass.:
35831.01
Organism:
Thiomicrospira crunogena (strain XCL-2)
Description:
ChEMBL_109899
Residue:
315
  
Inhibitor
Name:
BDBM10861
Synonyms:
4-(2-aminoethyl)benzene-1-sulfonamide aromatic sulfonamide compound 7 | aromatic/heteroaromatic sulfonamide 6
Type:
Small organic molecule
Emp. Form.:
C8H12N2O2S
Mol. Mass.:
200.258
SMILES:
NCCc1ccc(cc1)S(N)(=O)=O
: