Target
Carbonic anhydrase, alpha family
Ligand
BDBM10875
Substrate
Meas. Tech.
ChEMBL_1543854 (CHEMBL3749744)
Ki
2.5±n/a nM
Citation
 Vullo, DBhatt, AMahon, BPMcKenna, RSupuran, CT Sulfonamide inhibition studies of thea-carbonic anhydrase from the gammaproteobacterium Thiomicrospira crunogena XCL-2, TcruCA. Bioorg Med Chem Lett 26:401-5 (2016)  
Target
Name:
Carbonic anhydrase, alpha family
Synonyms:
Carbonic anhydrase, alpha family
Type:
PROTEIN
Mol. Mass.:
35831.01
Organism:
Thiomicrospira crunogena (strain XCL-2)
Description:
ChEMBL_109899
Residue:
315
  
Inhibitor
Name:
BDBM10875
Synonyms:
5-(2-chlorophenyl)-1,3,4-thiadiazole-2-sulfonamide Chlorzolamide, CHL JMC523116 Compound 19 | aromatic/heteroaromatic sulfonamide 20
Type:
Small organic molecule
Emp. Form.:
C8H6ClN3O2S2
Mol. Mass.:
275.735
SMILES:
NS(=O)(=O)c1nnc(s1)-c1ccccc1Cl
: