Target
Dihydrofolate reductase
Ligand
BDBM50049905
Substrate
Meas. Tech.
ChEMBL_1539068 (CHEMBL3738284)
Ki
0.030000±n/a nM
Citation
 Chao, BLi, BXXiao, X The chemistry and pharmacology of privileged pyrroloquinazolines. Medchemcomm 6:510-520 (2015)  
Target
Name:
Dihydrofolate reductase
Synonyms:
DFR1 Dihydrofolate Reductase (DHFR) | Tetrahydrofolate dehydrogenase
Type:
Enzyme
Mol. Mass.:
22141.77
Organism:
Candida albicans
Description:
C. albicans DHFR was expressed in E. coli BL21, and purified to homogeneity.
Residue:
192
  
Inhibitor
Name:
BDBM50049905
Synonyms:
7-(1-Ethyl-propyl)-8-methyl-7H-pyrrolo[3,2-f]quinazoline-1,3-diamine TCMDC-137283
Type:
Small organic molecule
Emp. Form.:
C16H21N5
Mol. Mass.:
283.3714
SMILES:
CCC(CC)n1c(C)cc2c1ccc1nc(N)nc(N)c21
: