Target
Cholinesterase
Ligand
BDBM50138431
Substrate
Meas. Tech.
ChEMBL_1549913 (CHEMBL3755060)
IC50
2.5±n/a nM
Citation
 Zha, XLamba, DZhang, LLou, YXu, CKang, DChen, LXu, YZhang, LDe Simone, ASamez, SPesaresi, AStojan, JLopez, MGEgea, JAndrisano, VBartolini, M Novel Tacrine-Benzofuran Hybrids as Potent Multitarget-Directed Ligands for the Treatment of Alzheimer's Disease: Design, Synthesis, Biological Evaluation, and X-ray Crystallography. J Med Chem 59:114-31 (2016)  
Target
Name:
Cholinesterase
Synonyms:
Acylcholine acylhydrolase Butyrylcholine esterase (BChE) Butyrylcholinesterase (BuChE) CHLE_HUMAN Cholinesterases Pseudocholinesterase
Type:
Homotetramer
Mol. Mass.:
68422.27
Organism:
Homo sapiens (Human)
Description:
P06276
Residue:
602
  
Inhibitor
Name:
BDBM50138431
Synonyms:
CHEMBL3751941
Type:
Small organic molecule
Emp. Form.:
C27H31N3O
Mol. Mass.:
413.5545
SMILES:
C(CCCNc1c2CCCc2nc2ccccc12)CCNCc1cc2ccccc2o1
: